{"text_format":"1","workbook":"xlsx","n_sheets":7,"sheets":["Selection","Data&Rules","RMXS Capacity","Results","Report","FlowChart","T&C"],"not_rendered":{"charts":0,"images":5,"macros":1,"external_links":0,"defined_names":18,"comments":1,"pivot_tables":3},"unopened":[],"bounds":{"document_bytes":16777216,"sheet_cells":100000,"rows_first":2000,"rows_last":500,"rows_between":2000,"halvings":0,"cell_chars":16384,"cell_head_chars":4096},"cells_cut":0,"cells_raw":0,"read":"whole","date_system":"1900"}

{"sheet":"Selection","index":0,"n_rows":34,"n_cols":28,"rows_kept":34,"cut":false,"hidden":false,"merged":[[29,4,29,5],[28,4,28,5],[27,4,27,5],[26,22,26,23],[29,6,29,7],[28,9,28,13],[1,8,1,25],[23,15,23,16],[23,22,23,23],[21,10,21,13],[20,10,20,11],[12,5,12,8],[11,5,11,6],[8,15,8,16],[16,1,17,7],[21,4,21,5],[20,4,20,5],[5,22,5,23],[8,22,8,23],[11,22,11,23],[14,1,15,3],[6,29,6,31],[26,6,26,7],[27,6,27,7],[28,6,28,7],[14,22,14,23],[17,22,17,23],[24,5,24,6],[20,22,20,23],[17,15,17,16],[22,4,22,5]]}
[]
[]
[]
[]
[null,null,null,null,null,null,null,null,null,null,null,null,null,null,null,null,null,null,null,null,null,null,null,"ft"]
[null,null,null,null,null,null,null,null,null,null,null,null,null,null,null,null,null,null,null,null,null,null,{"$f":"'Data&Rules'!P3","v":"x"},null,null,null,null,{"$f":"'Data&Rules'!Q3","v":"."}]
[]
[null,null,null,null,null,null,null,null,null,null,null,null,null,null,null,null,"ft",null,null,null,null,null,null,"ft"]
[null,null,null,null,null,null,null,null,null,null,null,null,null,null,null,{"$f":"IF('Data&Rules'!Q46=0,\"\",'Data&Rules'!Q46)","v":"x"},null,null,null,null,null,null,{"$f":"'Data&Rules'!P5","v":"x"},null,null,null,null,{"$f":"'Data&Rules'!Q5","v":"."}]
[null,null,null,null,null,null,null,null,null,null,null,null,null,null,null,null,null,null,{"$f":"'Data&Rules'!O46","v":"N/A"}]
[null,null,null,null,null,16.399999999999999,"ft",null,null,null,null,null,null,null,null,null,null,null,null,null,null,null,null,"ft"]
[null,null,null,null,null,{"$f":"IF('Data&Rules'!S55=\"\",\"\",'Data&Rules'!S55)","v":"3/8\"x3/4\""},null,null,null,null,null,null,null,null,null,null,null,null,null,null,null,null,{"$f":"'Data&Rules'!P7","v":"x"},null,null,null,null,{"$f":"'Data&Rules'!Q7","v":"."}]
[null,null,null,null,null,{"$f":"IF('Data&Rules'!T55=\"\",\"\",'Data&Rules'!T55)","v":""}]
[null,null,null,null,null,null,null,null,null,null,null,null,null,null,null,null,null,null,null,null,null,null,null,"ft"]
[null,"RMXS48LVJU",null,null,null,null,null,null,null,null,null,null,null,null,null,null,null,null,null,null,null,null,{"$f":"'Data&Rules'!P9","v":"x"},null,null,null,null,{"$f":"'Data&Rules'!Q9","v":"."}]
[]
[null,"Selection Check",null,null,null,null,null,null,null,null,null,null,null,null,null,null,"ft",null,null,null,null,null,null,"ft"]
[null,null,null,null,null,null,null,null,null,null,null,null,null,null,null,{"$f":"IF('Data&Rules'!Q47=0,\"\",'Data&Rules'!Q47)","v":"x"},null,null,null,null,null,null,{"$f":"'Data&Rules'!P11","v":"x"},null,null,null,null,{"$f":"'Data&Rules'!Q11","v":"."}]
[null,null,null,null,null,null,null,null,null,null,null,null,null,null,null,null,null,null,{"$f":"'Data&Rules'!O47","v":"N/A"}]
[null,"Total number of Indoor Units",null,null,null,{"$f":"IF('Data&Rules'!N19=0,\" \",'Data&Rules'!N19)","v":" "},null,null,null,null,null,"ft",null,null,null,null,null,null,null,null,null,null,null,"ft"]
{"$rows_left_out":15}
{"sheet":"Data&Rules","index":1,"n_rows":119,"n_cols":20,"rows_kept":119,"cut":false,"hidden":false,"merged":[[118,10,119,13],[108,8,108,9],[108,10,108,11],[108,4,108,5],[108,6,108,7],[90,2,90,3],[91,2,91,3],[107,4,107,5],[107,6,107,7],[107,8,107,9],[98,2,98,3],[99,2,99,3],[100,2,100,3],[101,2,101,3],[102,2,102,3],[93,2,93,3],[94,2,94,3],[95,2,95,3],[96,2,96,3],[97,2,97,3],[85,1,86,1],[85,2,86,3],[87,1,88,1],[87,2,88,3],[0,6,0,8],[43,6,43,8],[52,6,52,8],[66,2,67,3],[66,4,67,5],[64,2,65,3],[64,4,65,5],[0,3,0,5],[43,3,43,5],[52,3,52,5],[113,14,116,14],[112,1,116,3],[68,2,75,3],[76,1,76,3],[77,2,84,3],[77,1,84,1],[63,1,75,1],[63,2,63,3],[63,4,63,5],[107,10,107,11],[92,2,92,3],[89,1,92,1],[89,2,89,3],[103,2,103,3],[93,1,104,1],[104,2,104,3]]}
[null,"Indoor Unit","Capacity","Pipe Dimensions",null,null,"Type",null,null,null,null,"IU Items","Model","Selected  IU","Capacity","Pipe Dimensions","Type","Pipe Lengths"]
[1,null,null,"Gas","Liquid","x","."]
[2,"Ducted- FDXS09LVJU",9000," 3/8\" ","1/4\"","1/4\"x3/8\"","Slim Ducted Unit ",null,null,null,null,"IU-1",{"$f":"VLOOKUP(N3,$A$2:$C$36,2)","v":0},1,{"$f":"VLOOKUP(N3,$A$2:$C$36,3)","v":0},{"$f":"VLOOKUP(N3,$A$2:$F$36,6)","v":"x"},{"$f":"VLOOKUP(N3,$A$2:$G$36,7)","v":"."},{"$f":"IU1Pipe","v":0}]
[3,"Ducted- FDXS12LVJU",12000," 3/8\" ","1/4\"","1/4\"x3/8\"","Slim Ducted Unit "]
[4,"Ducted- CDXS15LVJU",15000," 1/2\" ","1/4\"","1/4\"x1/2\"","Slim Ducted Unit ",null,null,null,null,"IU-2",{"$f":"VLOOKUP(N5,$A$2:$C$36,2)","v":0},1,{"$f":"VLOOKUP(N5,$A$2:$C$36,3)","v":0},{"$f":"VLOOKUP(N5,$A$2:$F$36,6)","v":"x"},{"$f":"VLOOKUP(N5,$A$2:$G$36,7)","v":"."},{"$f":"IU2Pipe","v":0}]
[5,"Ducted- CDXS18LVJU",18000," 1/2\" ","1/4\"","1/4\"x1/2\"","Slim Ducted Unit "]
[6,"Ducted- CDXS24LVJU",24000," 5/8\" ","1/4\"","1/4\"x5/8\"","Slim Ducted Unit ",null,null,null,null,"IU-3",{"$f":"VLOOKUP(N7,$A$2:$C$36,2)","v":0},1,{"$f":"VLOOKUP(N7,$A$2:$C$36,3)","v":0},{"$f":"VLOOKUP(N7,$A$2:$F$36,6)","v":"x"},{"$f":"VLOOKUP(N7,$A$2:$G$36,7)","v":"."},{"$f":"IU3Pipe","v":0}]
[7,"Wall- CTXG09QVJUS",9000," 3/8\" ","1/4\"","1/4\"x3/8\"","EMURA Silver"]
[8,"Wall- CTXG12QVJUS",12000," 3/8\" ","1/4\"","1/4\"x3/8\"","EMURA Silver",null,null,null,null,"IU-4",{"$f":"VLOOKUP(N9,$A$2:$C$36,2)","v":0},1,{"$f":"VLOOKUP(N9,$A$2:$C$36,3)","v":0},{"$f":"VLOOKUP(N9,$A$2:$F$36,6)","v":"x"},{"$f":"VLOOKUP(N9,$A$2:$G$36,7)","v":"."},{"$f":"IU4Pipe","v":0}]
[9,"Wall- CTXG18QVJUS",18000," 1/2\" ","1/4\"","1/4\"x1/2\"","EMURA Silver"]
[10,"Wall- CTXG09QVJUW",9000," 3/8\" ","1/4\"","1/4\"x3/8\"","EMURA White",null,null,null,null,"IU-5",{"$f":"VLOOKUP(N11,$A$2:$C$36,2)","v":0},1,{"$f":"VLOOKUP(N11,$A$2:$C$36,3)","v":0},{"$f":"VLOOKUP(N11,$A$2:$F$36,6)","v":"x"},{"$f":"VLOOKUP(N11,$A$2:$G$36,7)","v":"."},{"$f":"IU5Pipe","v":0}]
[11,"Wall- CTXG12QVJUW",12000," 3/8\" ","1/4\"","1/4\"x3/8\"","EMURA White"]
[12,"Wall- CTXG18QVJUW",18000," 1/2\" ","1/4\"","1/4\"x1/2\"","EMURA White",null,null,null,null,"IU-6",{"$f":"VLOOKUP(N13,$A$2:$C$36,2)","v":0},1,{"$f":"VLOOKUP(N13,$A$2:$C$36,3)","v":0},{"$f":"VLOOKUP(N13,$A$2:$F$36,6)","v":"x"},{"$f":"VLOOKUP(N13,$A$2:$G$36,7)","v":"."},{"$f":"IU6Pipe","v":0}]
[13,"Wall- CTXS07LVJU",7000," 3/8\" ","1/4\"","1/4\"x3/8\"","Wall Mounted Unit "]
[14,"Wall- FTXS09LVJU",9000," 3/8\" ","1/4\"","1/4\"x3/8\"","Wall Mounted Unit ",null,null,null,null,"IU-7",{"$f":"VLOOKUP(N15,$A$2:$C$36,2)","v":0},1,{"$f":"VLOOKUP(N15,$A$2:$C$36,3)","v":0},{"$f":"VLOOKUP(N15,$A$2:$F$36,6)","v":"x"},{"$f":"VLOOKUP(N15,$A$2:$G$36,7)","v":"."},{"$f":"IU7Pipe","v":0}]
[15,"Wall- FTXS12LVJU",12000," 3/8\" ","1/4\"","1/4\"x3/8\"","Wall Mounted Unit "]
[16,"Wall- FTXS15LVJU",15000," 1/2\" ","1/4\"","1/4\"x1/2\"","Wall Mounted Unit ",null,null,null,null,"IU-8",{"$f":"VLOOKUP(N17,$A$2:$C$36,2)","v":0},1,{"$f":"VLOOKUP(N17,$A$2:$C$36,3)","v":0},{"$f":"VLOOKUP(N17,$A$2:$F$36,6)","v":"x"},{"$f":"VLOOKUP(N17,$A$2:$G$36,7)","v":"."},{"$f":"IU8Pipe","v":0}]
[17,"Wall- FTXS18LVJU",18000," 1/2\" ","1/4\"","1/4\"x1/2\"","Wall Mounted Unit "]
[18,"Wall- FTXS24LVJU",24000," 5/8\" ","1/4\"","1/4\"x5/8\"","Wall Mounted Unit ",null,null,null,null,"Total",null,{"$f":"COUNTIF(N3:N17,\">1\")","v":0},{"$f":"SUM(O3:O17)","v":0},null,{"$f":"COUNTIF(Q3:Q17,\"Slim Ducted Unit\")","v":0},{"$f":"SUM(R3:R17)","v":0}]
[19,"Cassette- FFQ09Q2VJU",9000," 3/8\" ","1/4\"","1/4\"x3/8\"","VISTA Cassette"]
{"$rows_left_out":100}
{"sheet":"RMXS Capacity","index":2,"n_rows":88,"n_cols":15,"rows_kept":88,"cut":false,"hidden":true,"merged":[[2,3,2,4],[2,6,2,7],[0,3,0,6]]}
[null,null,null,"RMXS48LVJU Capacity Table"]
[]
[null,null,"Model","CTXS, FTXS (Non Ducted)",null,null,"CDXS, FDXS (Ducted)",null,null,null,null,"Efficiency"]
[null,null,null,"Cooling Capacity @ 95/67","Heating Capacity @43/70",null,"Cooling Capacity @ 95/67","Heating Capacity @43/70",null,null,"Type","SEER","HSPF","EER","COP"]
[null,"Selected CR%","Combination (%)","Cooling Cap","Heating Cap",null,"Cooling Cap","Heating Cap"]
[null,{"$f":"'Data&Rules'!D109","v":0},{"$f":"VLOOKUP($B$6,$C$8:$H$88,1)","v":{"$error":"#N/A"}},{"$f":"VLOOKUP($B$6,$C$8:$H$88,2)","v":{"$error":"#N/A"}},{"$f":"VLOOKUP($B$6,$C$8:$H$88,3)","v":{"$error":"#N/A"}},null,{"$f":"VLOOKUP($B$6,$C$8:$H$88,5)","v":{"$error":"#N/A"}},{"$f":"VLOOKUP($B$6,$C$8:$H$88,6)","v":{"$error":"#N/A"}},null,{"$f":"IF((('Data&Rules'!N19-'Data&Rules'!Q19)/'Data&Rules'!N19)=1,J8,IF((('Data&Rules'!N19-'Data&Rules'!Q19)/'Data&Rules'!N19)=  0,J10,J9))","v":{"$error":"#DIV/0!"}},{"$f":"IF((('Data&Rules'!N19-'Data&Rules'!Q19)/'Data&Rules'!N19)=1,K8,IF((('Data&Rules'!N19-'Data&Rules'!Q19)/'Data&Rules'!N19)=  0,K10,K9))","v":{"$error":"#DIV/0!"}},{"$f":"VLOOKUP($J$6,$J$8:$O$10,3)","v":{"$error":"#DIV/0!"}},{"$f":"VLOOKUP($J$6,$J$8:$O$10,4)","v":{"$error":"#DIV/0!"}},{"$f":"VLOOKUP($J$6,$J$8:$O$10,5)","v":{"$error":"#DIV/0!"}},{"$f":"VLOOKUP($J$6,$J$8:$O$10,6)","v":{"$error":"#DIV/0!"}}]
[]
[null,null,0.5,24,29,null,24,29,null,1,"Non-Ducted",18.8,11.3,10.3,3]
[null,null,0.51,24.48,29.5,null,24.48,29.5,null,2,"Mixed",16.5,10.5,9.8000000000000007,2.9]
[null,null,0.52,24.96,30,null,24.96,30,null,3,"Ducted",14.1,9.6,9.3000000000000007,2.7]
[null,null,0.53,25.44,30.5,null,25.44,30.5]
[null,null,0.54,25.92,31,null,25.92,31]
[null,null,0.55000000000000004,26.4,31.5,null,26.4,31.5]
[null,null,0.56000000000000005,26.88,32,null,26.88,32]
[null,null,0.56999999999999995,27.36,32.5,null,27.36,32.5]
[null,null,0.57999999999999996,27.84,33,null,27.84,33]
[null,null,0.59,28.32,33.5,null,28.32,33.5]
[null,null,0.6,28.8,34,null,28.8,34]
[null,null,0.61,29.28,34.5,null,29.28,34.5]
[null,null,0.62,29.76,35,null,29.76,35]
{"$rows_left_out":69}
{"sheet":"Results","index":3,"n_rows":36,"n_cols":15,"rows_kept":36,"cut":false,"hidden":true,"merged":[[1,0,1,4],[34,1,34,4]]}
[]
["Results"]
[]
[null,"Outdoor Unit"]
[null,"Model","Qty","Description"]
[null,"RMXS48LVJU",1,"8 Zone Multi Split CU"]
[]
[]
[]
[null,"Indoor Unit"]
[null,"Model","Quantity","Description",null,null,null,null,null,null,null,"Row Labels","Count of Selected  IU","Model","Description"]
[null,"FDXS12LVJU",1,"Slim Ducted Unit ",null,null,null,null,null,null,null,1,6,{"$f":"IF(OR(M12=\"\",L12=\"Grand Total\"),0,VLOOKUP(L12,'Data&Rules'!$A$2:$G$30,2))","v":0},{"$f":"VLOOKUP(L12,'Data&Rules'!$A$2:$G$30,7)","v":"."}]
[null,"CDXS18LVJU",1,"Slim Ducted Unit ",null,null,null,null,null,null,null,3,1,{"$f":"IF(OR(M13=\"\",L13=\"Grand Total\"),0,VLOOKUP(L13,'Data&Rules'!$A$2:$G$30,2))","v":"Ducted- FDXS12LVJU"},{"$f":"VLOOKUP(L13,'Data&Rules'!$A$2:$G$30,7)","v":"Slim Ducted Unit "}]
[null,null,null,null,null,null,null,null,null,null,null,5,1,{"$f":"IF(OR(M14=\"\",L14=\"Grand Total\"),0,VLOOKUP(L14,'Data&Rules'!$A$2:$G$30,2))","v":"Ducted- CDXS18LVJU"},{"$f":"VLOOKUP(L14,'Data&Rules'!$A$2:$G$30,7)","v":"Slim Ducted Unit "}]
[null,null,null,null,null,null,null,null,null,null,null,"(blank)",null,{"$f":"IF(OR(M15=\"\",L15=\"Grand Total\"),0,VLOOKUP(L15,'Data&Rules'!$A$2:$G$30,2))","v":0},{"$f":"VLOOKUP(L15,'Data&Rules'!$A$2:$G$30,7)","v":{"$error":"#N/A"}}]
[null,null,null,null,null,null,null,null,null,null,null,"Grand Total",8,{"$f":"IF(OR(M16=\"\",L16=\"Grand Total\"),0,VLOOKUP(L16,'Data&Rules'!$A$2:$G$30,2))","v":0},{"$f":"VLOOKUP(L16,'Data&Rules'!$A$2:$G$30,7)","v":{"$error":"#N/A"}}]
[null,null,null,null,null,null,null,null,null,null,null,null,null,{"$f":"IF(OR(M17=\"\",L17=\"Grand Total\"),0,VLOOKUP(L17,'Data&Rules'!$A$2:$G$30,2))","v":0},{"$f":"VLOOKUP(L17,'Data&Rules'!$A$2:$G$30,7)","v":{"$error":"#N/A"}}]
[null,null,null,null,null,null,null,null,null,null,null,null,null,{"$f":"IF(OR(M18=\"\",L18=\"Grand Total\"),0,VLOOKUP(L18,'Data&Rules'!$A$2:$G$30,2))","v":0},{"$f":"VLOOKUP(L18,'Data&Rules'!$A$2:$G$30,7)","v":{"$error":"#N/A"}}]
[null,null,null,null,null,null,null,null,null,null,null,null,null,{"$f":"IF(OR(M19=\"\",L19=\"Grand Total\"),0,VLOOKUP(L19,'Data&Rules'!$A$2:$G$30,2))","v":0},{"$f":"VLOOKUP(L19,'Data&Rules'!$A$2:$G$30,7)","v":{"$error":"#N/A"}}]
[null,null,null,null,null,null,null,null,null,null,null,null,null,{"$f":"IF(OR(M20=\"\",L20=\"Grand Total\"),0,VLOOKUP(L20,'Data&Rules'!$A$2:$G$30,2))","v":0}]
{"$rows_left_out":17}
{"sheet":"Report","index":4,"n_rows":35,"n_cols":21,"rows_kept":35,"cut":false,"hidden":false,"merged":[[29,2,30,20],[31,2,31,20],[32,2,33,20],[6,19,6,20],[26,5,26,6],[22,5,22,6],[23,5,23,6],[24,5,24,6],[25,5,25,6],[9,17,10,20],[11,5,11,6],[9,8,10,14],[17,8,17,10],[17,11,17,14],[21,5,21,6],[16,5,16,6],[7,19,7,20],[15,5,15,6],[4,14,4,16],[5,4,5,7],[5,11,5,16],[6,4,6,7],[7,4,7,7],[6,11,6,16],[7,11,7,16],[9,2,10,6],[11,2,11,3],[19,5,19,6],[20,5,20,6],[12,5,12,6],[13,5,13,6],[14,5,14,6],[17,5,17,6],[18,5,18,6]]}
[]
[]
[]
[]
[null,null,null,null,null,null,null,null,null,null,null,null,null,"Produced on",{"$f":"TODAY()","v":"2020-04-21"},null,null,"with Daikin 8 Zone Multi Split Selection Tool"]
[null,null,"Project Name",null,null,null,null,null,null,"Client Name"]
[null,null,"Project Address",null,null,null,null,null,null,"Client Address",null,null,null,null,null,null,null,null,"Revision"]
[null,null,null,null,null,null,null,null,null,null,null,null,null,null,null,null,null,null,"Reference"]
[]
[null,null,"Material List",null,null,null,null,null,"Selection Details",null,null,null,null,null,null,null,null,"Selection Criteria"]
[]
[null,null,"Model",null,"Qty","Description"]
[null,null,{"$f":"IF(Results!B37=\"\",\"\",Results!B37)","v":""},null,{"$f":"IF(Results!C37=\"\",\"\",Results!C37)","v":""},{"$f":"IF(Results!D37=\"\",\"\",Results!D37)","v":""},null,null,{"$f":"Selection!B20","v":"Total number of Indoor Units"},null,null,null,null,{"$f":"Selection!F20","v":" "},null,null,null,"Cooling"]
[null,null,{"$f":"IF(Results!B38=\"\",\"\",Results!B38)","v":""},null,{"$f":"IF(Results!C38=\"\",\"\",Results!C38)","v":""},{"$f":"IF(Results!D38=\"\",\"\",Results!D38)","v":""},null,null,{"$f":"Selection!B21","v":"Total IU Capacity"},null,null,null,null,{"$f":"Selection!E21","v":" "},"MBH",null,null,"Indoor","80° FDB - 67° FWB"]
[null,null,{"$f":"IF(Results!B39=\"\",\"\",Results!B39)","v":""},null,{"$f":"IF(Results!C39=\"\",\"\",Results!C39)","v":""},{"$f":"IF(Results!D39=\"\",\"\",Results!D39)","v":""},null,null,{"$f":"Selection!B22","v":"Available Cooling Capacity"},null,null,null,null,{"$f":"Selection!E22","v":" "},"MBH",null,null,"Outdoor","95° FDB"]
[null,null,{"$f":"IF(Results!B40=\"\",\"\",Results!B40)","v":""},null,{"$f":"IF(Results!C40=\"\",\"\",Results!C40)","v":""},{"$f":"IF(Results!D40=\"\",\"\",Results!D40)","v":""},null,null,{"$f":"Selection!B23","v":"Available Heating Capacity"},null,null,null,null,{"$f":"Selection!E23","v":" "},"MBH"]
[null,null,{"$f":"IF(Results!B41=\"\",\"\",Results!B41)","v":""},null,{"$f":"IF(Results!C41=\"\",\"\",Results!C41)","v":""},{"$f":"IF(Results!D41=\"\",\"\",Results!D41)","v":""},null,null,null,null,null,null,null,null,null,null,null,"Heating"]
[null,null,{"$f":"IF(Results!B42=\"\",\"\",Results!B42)","v":""},null,{"$f":"IF(Results!C42=\"\",\"\",Results!C42)","v":""},{"$f":"IF(Results!D42=\"\",\"\",Results!D42)","v":""},null,null,"Cooling Efficiency",null,null,"Heating Efficiency",null,null,null,null,null,"Indoor","70° FDB"]
[null,null,{"$f":"IF(Results!B43=\"\",\"\",Results!B43)","v":""},null,{"$f":"IF(Results!C43=\"\",\"\",Results!C43)","v":""},{"$f":"IF(Results!D43=\"\",\"\",Results!D43)","v":""},null,null,"SEER",{"$f":"'RMXS Capacity'!L6","v":{"$error":"#DIV/0!"}},null,null,"HSPF",{"$f":"'RMXS Capacity'!M6","v":{"$error":"#DIV/0!"}},null,null,null,"Outdoor","47° FDB - 43° FWB"]
[null,null,{"$f":"IF(Results!B44=\"\",\"\",Results!B44)","v":""},null,{"$f":"IF(Results!C44=\"\",\"\",Results!C44)","v":""},{"$f":"IF(Results!D44=\"\",\"\",Results!D44)","v":""},null,null,"EER",{"$f":"'RMXS Capacity'!N6","v":{"$error":"#DIV/0!"}},null,null,"COP",{"$f":"'RMXS Capacity'!O6","v":{"$error":"#DIV/0!"}}]
{"$rows_left_out":16}
{"sheet":"FlowChart","index":5,"n_rows":0,"n_cols":0,"rows_kept":0,"cut":false,"hidden":false,"merged":[]}

{"sheet":"T&C","index":6,"n_rows":32,"n_cols":8,"rows_kept":32,"cut":false,"hidden":false,"merged":[[4,7,4,13],[8,2,8,17],[5,2,5,17],[10,2,10,17],[11,2,11,17],[6,2,6,17],[7,2,7,17],[13,2,13,17],[15,2,15,17],[14,4,14,6],[14,2,14,3],[31,7,31,9],[17,2,17,17],[20,2,20,17],[22,2,22,17],[24,2,24,17],[26,2,27,17],[28,2,28,17],[18,4,18,6]]}
[]
[]
[]
[]
[null,null,null,null,null,null,null,"Terms and Conditions of Use, Disclaimer and Copyright Notice"]
[null,null,"Please read through these terms and conditions of use, the disclaimer and the copyright notice contained herein carefully."]
[null,null,"Please read through these terms and conditions of use, the disclaimer and the copyright notice contained herein carefully."]
[null,null,"To use the Tool You must agree to be bound by the terms and conditions of use, the disclaimer and the copyright notice contained herein .   If You do not agree with all of these terms and conditions of use, the disclaimer and the copyright notice, You may not use the Tool in any manner."]
[null,null,"You further represent that You are authorized to acknowledge and accept these terms and conditions of use, the disclaimer and the copyright notice contained herein on behalf of any entity for whom You are utilizing the Tool."]
[null,null,"Usage provisions"]
[null,null,"Subject to the terms and conditions of this Agreement, permission is granted to You to use the Tool to assist in calculations used to determine the selection of Daikin equipment.    If an upgrade or update to the Tool is made, Your prior download may continue to operate or may expire over time, but it will NOT automatically update.  To receive an update will require You to request and receive an updated copy of the Tool, and You will be required to accept these terms and conditions, the disclaimer and the copyright notice again in order to receive or download the latest version of the Tool."]
[null,null,"The Tool may be downloaded and emailed for internal use to other users within Your organization.  You may not make any modifications or changes to or tamper with the Tool when emailing it internally or otherwise.  Any party receiving the Tool shall agree that he or she is subject to the requirements of this Agreement or they are not authorized to use and shall not use the Tool."]
[null,null,"Copyright"]
[null,null,"Nothing in this Agreement shall give You any rights in respect of the intellectual property of Daikin, and You acknowledge that You do not acquire any rights in respect of such intellectual property rights. This Agreement and the Tool are intended for use only by distributors, dealers and representatives of Daikin products.  The Tool is distributed only to assist with selecting products of Daikin. You are advised that the sale, lease, or rental of the Tool in any form without prior written authority from Daikin is prohibited.  Other than the internal right to distribute by email within Your organization as described above, this work may NOT be reproduced, disclosed or distributed to any person without written authorization from an officer of Daikin.  You "]
[null,null,"can apply for permission via",null,"trlhelp@daikincomfort.com"]
[null,null,"Any unauthorized reproduction, disclosure, or distribution of copies by any person of any portion of this work may be a violation of Copyright Law of the United States of America and other countries, could result in the awarding of statutory damages up to $250,000 (17 USC 504) for infringement, and may result in further civil and criminal penalties."]
[null,null,"Trade Name / Trade Marks"]
[null,null,"All Trade Names, Trade Marks, Logos and Pictures displayed through the Tool (if any) that belong to Daikin now or hereafter is/shall be the sole property of or are licensed to Daikin or its affiliate(s). Your use of the Tool should not be construed as granting, by implication or otherwise, any license or right to use any Trade Names, Trade Marks, logos and pictures displayed through the Tool (if any) without the prior written consent of Daikin."]
[null,null,"You can apply for consent via",null,"trlhelp@daikincomfort.com"]
[null,null,"No liability"]
{"$rows_left_out":12}